Installations fehler mit make

Allgemeine Informationen zu SvxLink

Installations fehler mit make

Beitragvon v51kf » So 20. Aug 2017, 09:17

Hi wenn ich den make command eintippe kriee ich diesen fehler

root@svxlink-IPMSB-H61:/home/svxlink/svxlink-14.08.1/src/build# sudo make install
[ 9%] Built target asynccore
[ 10%] Built target asynccpp
[ 29%] Built target asyncaudio
[ 30%] Built target AsyncExec_demo
[ 31%] Built target AsyncDnsLookup_demo
[ 32%] Built target AsyncAtTimer_demo
[ 33%] Built target AsyncFdWatch_demo
[ 34%] Built target AsyncCppApplication_demo
[ 35%] Built target AsyncAudioIO_demo
[ 36%] Built target AsyncTimer_demo
[ 37%] Built target AsyncConfig_demo
[ 38%] Built target AsyncSerial_demo
[ 39%] Built target AsyncTcpClient_demo
[ 40%] Built target AsyncUdpSocket_demo
[ 41%] Built target AsyncTcpServer_demo
[ 47%] Built target echolib
[ 48%] Built target EchoLinkDispatcher_demo
[ 49%] Built target EchoLinkDirectory_demo
[ 50%] Built target EchoLinkQso_demo
[ 52%] Built target echolib_test
[ 54%] Built target locationinfo
[ 54%] Building CXX object svxlink/trx/CMakeFiles/trx.dir/ToneDetector.cpp.o
In file included from /home/svxlink/svxlink-14.08.1/src/svxlink/trx/ToneDetector.cpp:58:0:
/home/svxlink/svxlink-14.08.1/src/svxlink/trx/ToneDetector.h:454:54: error: ‘constexpr’ needed for in-class initialization of static data member ‘const float ToneDetector::DEFAULT_TONE_ENERGY_THRESH’ of non-integral type [-fpermissive]
static const float DEFAULT_TONE_ENERGY_THRESH = 0.1f;
^~~~
/home/svxlink/svxlink-14.08.1/src/svxlink/trx/ToneDetector.h:455:48: error: ‘constexpr’ needed for in-class initialization of static data member ‘const float ToneDetector::DEFAULT_PEAK_THRESH’ of non-integral type [-fpermissive]
static const float DEFAULT_PEAK_THRESH = 10.0;
^~~~
/home/svxlink/svxlink-14.08.1/src/svxlink/trx/ToneDetector.h:456:53: error: ‘constexpr’ needed for in-class initialization of static data member ‘const float ToneDetector::DEFAULT_PHASE_MEAN_THRESH’ of non-integral type [-fpermissive]
static const float DEFAULT_PHASE_MEAN_THRESH = 0.0f;
^~~~
/home/svxlink/svxlink-14.08.1/src/svxlink/trx/ToneDetector.h:457:52: error: ‘constexpr’ needed for in-class initialization of static data member ‘const float ToneDetector::DEFAULT_PHASE_VAR_THRESH’ of non-integral type [-fpermissive]
static const float DEFAULT_PHASE_VAR_THRESH = 0.0f;
^~~~
svxlink/trx/CMakeFiles/trx.dir/build.make:67: recipe for target 'svxlink/trx/CMakeFiles/trx.dir/ToneDetector.cpp.o' failed
make[2]: *** [svxlink/trx/CMakeFiles/trx.dir/ToneDetector.cpp.o] Error 1
CMakeFiles/Makefile2:1112: recipe for target 'svxlink/trx/CMakeFiles/trx.dir/all' failed
make[1]: *** [svxlink/trx/CMakeFiles/trx.dir/all] Error 2
Makefile:127: recipe for target 'all' failed
make: *** [all] Error 2


hoffe jemand kann mihr da helfen

73
v51kf
 
Beiträge: 2
Registriert: Sa 19. Aug 2017, 18:49

Re: Installations fehler mit make

Beitragvon dl1hrc » So 20. Aug 2017, 10:00

Hi,

hast Du eventuell noch ein paar mehr Infos. Das hier
svxlink-14.08.1
deutet auf eine Uralt-Version von SvxLink hin.
Welches Betriebssystem in welcher Version, z.B.?

73
dl1hrc
 
Beiträge: 1113
Registriert: So 30. Jan 2011, 19:28

Re: Installations fehler mit make

Beitragvon DL7ATA » So 20. Aug 2017, 17:00

Adi, ich übernehme diesen Fall mal aktiv und kümmere mich per SSH darum.
Habe gerade Kontakt gehabt mit den V51er OM.
73 de Frank

EL-Node #41041
| solar powered |
DL7ATA
 
Beiträge: 166
Registriert: Fr 11. Nov 2011, 10:57
Wohnort: JO62ON

Re: Installations fehler mit make

Beitragvon dl1hrc » So 20. Aug 2017, 18:01

Hi Frank,

na das klingt ja gut, eine Sorge weniger...aber mach bitte kein zweites BER draus, ok? Der Node sollte vor 2345 in Betrieb gehen :lol:
So, jetzt hab ich's Euch wieder gezeigt :lol:

vy 73s de Adi / DL1HRC
dl1hrc
 
Beiträge: 1113
Registriert: So 30. Jan 2011, 19:28

Re: Installations fehler mit make

Beitragvon v51kf » Mo 21. Aug 2017, 21:27

bin neu auf ubuntu/lubuntu, brauche mehr details fuer ssh connection, welche ip ist noetig?

gruss

Klaus
v51kf
 
Beiträge: 2
Registriert: Sa 19. Aug 2017, 18:49

Re: Installations fehler mit make

Beitragvon DL7ATA » Mo 25. Sep 2017, 10:15

Dem Kollegen aus Namibia konnte geholfen werden - der Beschleunigung anlässlich einer vorgezogenen Eröffnung des BER vor 2345 - leider nicht.
:geek:
73 de Frank

EL-Node #41041
| solar powered |
DL7ATA
 
Beiträge: 166
Registriert: Fr 11. Nov 2011, 10:57
Wohnort: JO62ON

Re: Installations fehler mit make

Beitragvon dl1hrc » Mo 25. Sep 2017, 12:31

- der Beschleunigung anlässlich einer vorgezogenen Eröffnung des BER vor 2345 - leider nicht.


Na, Ihr habt ja noch ein kleines Flugfeld im Norden das den Betrieb aufrecht erhält. Im Süden kommt neben das neue Terminal noch 'ne Leichtmetallhalle und gut ist's. Man hat zwar kaum Sitzgelegenheiten und kann kaum treten aber für ein paar Jahrzehnte geht das sicher noch :lol:
Zur Not macht Ihr halt Gatow wieder auf oder legt ein paar Betonplatten in Saarmund....sollte passen.
dl1hrc
 
Beiträge: 1113
Registriert: So 30. Jan 2011, 19:28


Zurück zu SvxLink - Allgemein



Wer ist online?

Mitglieder in diesem Forum: 0 Mitglieder und 1 Gast

cron